Hallöchen liebe Gemeinde =)
Ich habe mir das neuste Paket von Boson runtergeladen. ( boson-all-0.12.tar.bz2 )
Nachdem ich alle abhängigkeiten nach installiert hatte und cmake flüssig durchlief , hat der Befehl make mir zwei Fehler ausgespuckt ...
Generating bosonprofilingdialoggui.h
Generating bosonprofilingdialoggui.cpp
Generating bosonprofilingdialoggui.moc.cpp
Scanning dependencies of target bosonmainlib
Building CXX object code/boson/CMakeFiles/bosonmainlib.dir/bosonviewdata.o
Building CXX object code/boson/CMakeFiles/bosonmainlib.dir/botooltipcreator.o
Building CXX object code/boson/CMakeFiles/bosonmainlib.dir/bosonglwidget.o
Building CXX object code/boson/CMakeFiles/bosonmainlib.dir/bosonufoglwidget.o
/home/lurban/Documents/boson-all-0.12/boson-all-0.12/code/boson/boufo/boufowidge t.h:493: warning: unused parameter ‘maxSize’
/home/lurban/Documents/boson-all-0.12/boson-all-0.12/code/boson/bosonufoglwidget .cpp:38: error: extra qualification ‘BoUfoRealProfiling::’ on member ‘push’
/home/lurban/Documents/boson-all-0.12/boson-all-0.12/code/boson/bosonufoglwidget .cpp:42: error: extra qualification ‘BoUfoRealProfiling::’ on member ‘pop’
make[2]: *** [code/boson/CMakeFiles/bosonmainlib.dir/bosonufoglwidget.o] Fehler 1
make[1]: *** [code/boson/CMakeFiles/bosonmainlib.dir/all] Fehler 2
make: *** [all] Fehler 2
lurban@suse-baer:~/Documents/boson-all-0.12/boson-all-0.12/build/code>
... nun kann ich nichts mit dieser Fehlermeldung anfangen, finde auch nichts darüber in der Wiki ( link zu finden http://boson.eu.org/ ) ....
Ich hoffe keine Info vergessen zu haben =)
Ich habe mir das neuste Paket von Boson runtergeladen. ( boson-all-0.12.tar.bz2 )
Nachdem ich alle abhängigkeiten nach installiert hatte und cmake flüssig durchlief , hat der Befehl make mir zwei Fehler ausgespuckt ...
Generating bosonprofilingdialoggui.h
Generating bosonprofilingdialoggui.cpp
Generating bosonprofilingdialoggui.moc.cpp
Scanning dependencies of target bosonmainlib
Building CXX object code/boson/CMakeFiles/bosonmainlib.dir/bosonviewdata.o
Building CXX object code/boson/CMakeFiles/bosonmainlib.dir/botooltipcreator.o
Building CXX object code/boson/CMakeFiles/bosonmainlib.dir/bosonglwidget.o
Building CXX object code/boson/CMakeFiles/bosonmainlib.dir/bosonufoglwidget.o
/home/lurban/Documents/boson-all-0.12/boson-all-0.12/code/boson/boufo/boufowidge t.h:493: warning: unused parameter ‘maxSize’
/home/lurban/Documents/boson-all-0.12/boson-all-0.12/code/boson/bosonufoglwidget .cpp:38: error: extra qualification ‘BoUfoRealProfiling::’ on member ‘push’
/home/lurban/Documents/boson-all-0.12/boson-all-0.12/code/boson/bosonufoglwidget .cpp:42: error: extra qualification ‘BoUfoRealProfiling::’ on member ‘pop’
make[2]: *** [code/boson/CMakeFiles/bosonmainlib.dir/bosonufoglwidget.o] Fehler 1
make[1]: *** [code/boson/CMakeFiles/bosonmainlib.dir/all] Fehler 2
make: *** [all] Fehler 2
lurban@suse-baer:~/Documents/boson-all-0.12/boson-all-0.12/build/code>
... nun kann ich nichts mit dieser Fehlermeldung anfangen, finde auch nichts darüber in der Wiki ( link zu finden http://boson.eu.org/ ) ....
Ich hoffe keine Info vergessen zu haben =)