AVM Stick installieren

3joe3

Newbie
hallo.
Ich wollte meine AVM USB FRitz Wlan Stick unter Suse 10 installieren.

Hab mir hierfür den Treiber von AVM runtergeladen. Die Datei habe ich per Rechtsklick entpackt, woraufhin sich ein FRITZ Ordner gebildet hat.

Nun soll ich im Unterordner SRC die Datei make && Make install ausführen.

Hierfür hab ich ein Terminal geöffnet und dann nacheinander folgendes eingegben:

su
rootpasswort
make
make install

allerdings kam schon nach make folgende Meldung:

make[1]: Entering directory `/usr/scr/linux-2.6.13-15-obj/i386/default`
make[1]: ***keine Regel, um >>modules<< zu erstellen. Schluss.
make[1]: leaving directory
make: *** [fwlanusb.0] Fehler 2

nach make install eine ähnliche.

Was soll ich nun tun??

Meine Suse10:
KDE 3.4.2 level "b"
Version 2.6.13-15-default
i686

Danke für die Hilfe
 

3joe3

Newbie
Hab nun mal meine Kernel Sourcen nachinstlalliert. Nun kommt nachdem ich Make eingebe, folgende Meldung:

make -C /lib/modules/2.6.13-15-smp/build SUBDIRS=/home/susanne/Desktop/fritz/scr

modules

make[1]: Entering directory '/usr/scr/linux-2.6.13-15obj/i386/smp'
make -C ../../../linux-2.6.13-150=../inux-2.6.13-15obj/i386/smp modules
/usr/scr/inux-2.6.13-15/scripts/gcc-version.sh:line11:gcc:co
mmand not found
/usr/scr/inux-2.6.13-15/scripts/gcc-version.sh:line12:gcc:co
mmand not found
make [3]: gcc: kommando nicht gefunden
CC[M] /home/susanne/Desktop/fritz/src/main.o
/bin/sh: gcc: command not found
make [4]: ***[/home/susanne/Desktop/fritz/src/main.o] Fehler 127
make [3]: ***[_module_/home/susanne/Desktop/fritz/src] Fehler 2
make [2]: ***[modules] Fehler 2
make [1]: leaving directory '/usr/scr/linux-2.6.3.13-15obj/i386/smp'
make: *** [fwlanusb.o] Fehler 2


DANKE
 

3joe3

Newbie
Ah ja. Danke.
Sorry, aber bin noch Linux Frischling und kenne mich noch überhaubt nicht aus.
hab jetzt über YaST Compiler installiert

Nun kommt folgende Meldung nachdem ich make eingebe:

/home/susanne/Desktop/fritz/src/lib.c: In function os_protect_lock:
/home/susanne/Desktop/fritz/src/lib.c: 402: error: incompatible type for argument 1 of _spin_lock_irqsave


/home/susanne/Desktop/fritz/src/lib.c: In function os_protect_unlock:
/home/susanne/Desktop/fritz/src/lib.c: 426: error: incompatible type for argument 1 of _spin_unlock_irqrestore
 
Oben